FAO WCA Crop List v1.0
type: Ontology
type: NamedIndividual
type: ConceptScheme
version info: 1.0
notation: WCACROPS
contributor: Caterina Caracciolo
contributor: Valeria Pesce
created: 2010-12-31
creator: Food and Agriculture Organization of the United Nations (FAO)
modified: 2019-07-11
history note: FAO WCA Crop List v1.0 v1.0Version 1.0 of SKOS serialization
source: http://www.fao.org/world-census-agriculture/wcarounds/wca2010/en
description: The more granular crop classification used in the FAO WCA. Used in the 2010 round of agricultural censuses. Mapped to ICC 1., ICC 1.1, CPC 2.1.
publisher: Food and Agriculture Organization of the United Nations (FAO)
title: FAO WCA Crop List published as RDF/SKOS (v1.0, draft)
has top concept: Manioc (cassava)
has top concept: Abaca (Manila hemp)
has top concept: Alfalfa for fodder
has top concept: Alfalfa for seed
has top concept: Almond
has top concept: Angelica stems
has top concept: Anise seeds
has top concept: Apple
has top concept: Apricot
has top concept: Areca (betel nut)
has top concept: Arracha
has top concept: Arrowroot
has top concept: Artichoke
has top concept: Asparagus
has top concept: Avocado
has top concept: Bajra (Pearl millet)
has top concept: Bambara bean
has top concept: Banana
has top concept: Barley
has top concept: Basil
has top concept: Bay leaves
has top concept: Beans dry edible for grains
has top concept: Beans harvested green
has top concept: Beet fodder (mangel)
has top concept: Beet red
has top concept: Beet sugar
has top concept: Beet sugar for fodder
has top concept: Beet sugar for seeds
has top concept: Bergamot
has top concept: Betel nut
has top concept: Black pepper
has top concept: Blackberries of various species
has top concept: Blueberry
has top concept: Brazil nut
has top concept: Breadfruit
has top concept: Broad bean dry
has top concept: Broad bean harvested green
has top concept: Broccoli
has top concept: Broom millet
has top concept: Broom sorghum
has top concept: Brussels sprouts
has top concept: Buckwheat
has top concept: Cabbage (red white Savoy)
has top concept: Cabbage Chinese
has top concept: Cabbage for fodder
has top concept: Cacao (cocoa)
has top concept: Cantaloupe
has top concept: Caraway seeds
has top concept: Cardamom
has top concept: Cardoon
has top concept: Carob
has top concept: Carrot edible
has top concept: Carrot for fodder
has top concept: Cashew nuts
has top concept: Cassava (manioc)
has top concept: Castor bean
has top concept: Cauliflower
has top concept: Celeriac
has top concept: Celery
has top concept: Chayote
has top concept: Cherry
has top concept: Chestnut
has top concept: Chickpea (gram pea)
has top concept: Chicory